CRAN Package Check Results for Package multimedia

Last updated on 2026-10-20 01:50:17 CEST.

Flavor Version Tinstall Tcheck Ttotal Status Flags
r-devel-linux-x86_64-debian-clang 0.2.0 48.46 977.23 1025.69 NOTE
r-devel-linux-x86_64-debian-gcc 0.2.0 40.45 684.78 725.23 NOTE
r-devel-linux-x86_64-fedora-clang 0.2.0 43.00 603.03 646.03 NOTE
r-devel-linux-x86_64-fedora-gcc 0.2.0 42.00 645.01 687.01 NOTE
r-devel-windows-x86_64 0.2.0 56.00 807.00 863.00 ERROR
r-patched-linux-x86_64 0.2.0 49.49 978.98 1028.47 NOTE
r-release-linux-x86_64 0.2.0 46.79 978.23 1025.02 NOTE
r-release-macos-arm64 0.2.0 14.00 210.00 224.00 NOTE
r-release-macos-x86_64 0.2.0 37.00 954.00 991.00 NOTE
r-release-windows-x86_64 0.2.0 53.00 763.00 816.00 ERROR
r-oldrel-macos-arm64 0.2.0 NOTE
r-oldrel-macos-x86_64 0.2.0 33.00 1168.00 1201.00 NOTE
r-oldrel-windows-x86_64 0.2.0 72.00 1139.00 1211.00 ERROR

Check Details

Version: 0.2.0
Check: DESCRIPTION meta-information
Result: NOTE Missing dependency on R >= 4.2.0 because package code uses the pipe placeholder syntax added in R 4.2.0. File(s) using such syntax: ‘predict.R’ ‘sensitivity.R’ ‘treatment_profile.R’ Flavors: r-devel-linux-x86_64-debian-clang, r-devel-linux-x86_64-debian-gcc, r-devel-linux-x86_64-fedora-clang, r-devel-linux-x86_64-fedora-gcc, r-devel-windows-x86_64, r-patched-linux-x86_64, r-release-linux-x86_64, r-release-macos-arm64, r-release-macos-x86_64, r-release-windows-x86_64, r-oldrel-macos-arm64, r-oldrel-macos-x86_64, r-oldrel-windows-x86_64

Version: 0.2.0
Check: tests
Result: ERROR Running 'testthat.R' [101s] Running the tests in 'tests/testthat.R' failed. Complete output: > # This file is part of the standard setup for testthat. > # It is recommended that you do not modify it. > # > # Where should you do additional test configuration? > # Learn more about the roles of various files in: > # * https://r-pkgs.org/testing-design.html#sec-tests-files-overview > # * https://testthat.r-lib.org/articles/special-files.html > > library(testthat) > library(multimedia) Loading required package: brms Loading required package: Rcpp Loading 'brms' package (version 2.23.0). Useful instructions can be found by typing help('brms'). A more detailed introduction to the package is available through vignette('brms_overview'). Attaching package: 'brms' The following object is masked from 'package:stats': ar Loading required package: glmnetUtils Loading required package: ranger Loading required package: tidyselect > > test_check("multimedia") Bootstrapping direct Bootstrapping direct Indirect effects for direct setting 1 Indirect effects for direct setting 2 Compiling Stan program... specified C++17 make cmd is make -f "D:/RCompile/recent/R/etc/x64/Makeconf" -f "D:/RCompile/recent/R/share/make/winshlib.mk" CXX='$(CXX17) $(CXX17STD)' CXXFLAGS='$(CXX17FLAGS)' CXXPICFLAGS='$(CXX17PICFLAGS)' SHLIB_LDFLAGS='$(SHLIB_CXX17LDFLAGS)' SHLIB_LD='$(SHLIB_CXX17LD)' SHLIB="file832458e4213a.dll" WIN=64 TCLBIN= OBJECTS="file832458e4213a.o" make would use make[1]: Entering directory '/d/temp/2026_10_15_10_16_52_18621/RtmpcnFKe7' g++ -std=gnu++17 -I"D:/RCompile/recent/R/include" -DNDEBUG -I"D:/RCompile/CRANpkg/lib/4.7/Rcpp/include/" -I"D:/temp/2026_10_15_10_16_52_18621/Rtmp6nQJU6/RLIBS_2e7901b9b3ca4/RcppEigen/include/" -I"D:/temp/2026_10_15_10_16_52_18621/Rtmp6nQJU6/RLIBS_2e7901b9b3ca4/RcppEigen/include/unsupported" -I"D:/temp/2026_10_15_10_16_52_18621/Rtmp6nQJU6/RLIBS_2e7901b9b3ca4/BH/include" -I"D:/RCompile/CRANpkg/lib/4.7/StanHeaders/include/src/" -I"D:/RCompile/CRANpkg/lib/4.7/StanHeaders/include/" -I"D:/RCompile/CRANpkg/lib/4.7/RcppParallel/include/" -DRCPP_PARALLEL_USE_TBB=1 -DTBB_INTERFACE_NEW -ID:/RCompile/CRANpkg/lib/4.7/RcppParallel/include -I"D:/RCompile/CRANpkg/lib/4.7/rstan/include" -DEIGEN_NO_DEBUG -DBOOST_DISABLE_ASSERTS -DBOOST_PENDING_INTEGER_LOG2_HPP -DSTAN_THREADS -DUSE_STANC3 -DSTRICT_R_HEADERS -DBOOST_PHOENIX_NO_VARIADIC_EXPRESSION -D_HAS_AUTO_PTR_ETC=0 -include "D:/RCompile/CRANpkg/lib/4.7/StanHeaders/include/stan/math/prim/fun/Eigen.hpp" -std=c++1y -I"d:/rtools45/x86_64-w64-mingw32.static.posix/include" -O2 -Wall -mfpmath=sse -msse2 -mstackrealign -c file832458e4213a.cpp -o file832458e4213a.o if test "zfile832458e4213a.o" != "z"; then \ if test -e "file832458e4213a-win.def"; then \ echo g++ -shared -s -static-libgcc -o file832458e4213a.dll file832458e4213a-win.def file832458e4213a.o "D:/RCompile/CRANpkg/lib/4.7/rstan/lib/x64/libStanServices.a" -L"D:/RCompile/CRANpkg/lib/4.7/StanHeaders/libs/x64" -lStanHeaders -L"D:/RCompile/CRANpkg/lib/4.7/RcppParallel/lib/x64" -ltbb -LD:/RCompile/CRANpkg/lib/4.7/RcppParallel/libs/x64 -lRcppParallel -LD:/RCompile/CRANpkg/lib/4.7/RcppParallel/lib/x64 -ltbb -ltbbmalloc -L"d:/rtools45/x86_64-w64-mingw32.static.posix/lib/x64" -L"d:/rtools45/x86_64-w64-mingw32.static.posix/lib" -L"D:/RCompile/recent/R/bin/x64" -lR ; \ g++ -shared -s -static-libgcc -o file832458e4213a.dll file832458e4213a-win.def file832458e4213a.o "D:/RCompile/CRANpkg/lib/4.7/rstan/lib/x64/libStanServices.a" -L"D:/RCompile/CRANpkg/lib/4.7/StanHeaders/libs/x64" -lStanHeaders -L"D:/RCompile/CRANpkg/lib/4.7/RcppParallel/lib/x64" -ltbb -LD:/RCompile/CRANpkg/lib/4.7/RcppParallel/libs/x64 -lRcppParallel -LD:/RCompile/CRANpkg/lib/4.7/RcppParallel/lib/x64 -ltbb -ltbbmalloc -L"d:/rtools45/x86_64-w64-mingw32.static.posix/lib/x64" -L"d:/rtools45/x86_64-w64-mingw32.static.posix/lib" -L"D:/RCompile/recent/R/bin/x64" -lR ; \ else \ echo EXPORTS > tmp.def; \ nm file832458e4213a.o | sed -n 's/^.* [BCDRT] / /p' | sed -e '/[.]refptr[.]/d' -e '/[.]weak[.]/d' | sed 's/[^ ][^ ]*/"&"/g' >> tmp.def; \ echo g++ -shared -s -static-libgcc -o file832458e4213a.dll tmp.def file832458e4213a.o "D:/RCompile/CRANpkg/lib/4.7/rstan/lib/x64/libStanServices.a" -L"D:/RCompile/CRANpkg/lib/4.7/StanHeaders/libs/x64" -lStanHeaders -L"D:/RCompile/CRANpkg/lib/4.7/RcppParallel/lib/x64" -ltbb -LD:/RCompile/CRANpkg/lib/4.7/RcppParallel/libs/x64 -lRcppParallel -LD:/RCompile/CRANpkg/lib/4.7/RcppParallel/lib/x64 -ltbb -ltbbmalloc -L"d:/rtools45/x86_64-w64-mingw32.static.posix/lib/x64" -L"d:/rtools45/x86_64-w64-mingw32.static.posix/lib" -L"D:/RCompile/recent/R/bin/x64" -lR ; \ g++ -shared -s -static-libgcc -o file832458e4213a.dll tmp.def file832458e4213a.o "D:/RCompile/CRANpkg/lib/4.7/rstan/lib/x64/libStanServices.a" -L"D:/RCompile/CRANpkg/lib/4.7/StanHeaders/libs/x64" -lStanHeaders -L"D:/RCompile/CRANpkg/lib/4.7/RcppParallel/lib/x64" -ltbb -LD:/RCompile/CRANpkg/lib/4.7/RcppParallel/libs/x64 -lRcppParallel -LD:/RCompile/CRANpkg/lib/4.7/RcppParallel/lib/x64 -ltbb -ltbbmalloc -L"d:/rtools45/x86_64-w64-mingw32.static.posix/lib/x64" -L"d:/rtools45/x86_64-w64-mingw32.static.posix/lib" -L"D:/RCompile/recent/R/bin/x64" -lR ; \ rm -f tmp.def; \ fi \ fi make[1]: Leaving directory '/d/temp/2026_10_15_10_16_52_18621/RtmpcnFKe7' Saving _problems/test-estimators-29.R Fitting the nullified model... Generating synthetic data... Fitting the full model on synthetic data... Estimating effects on real and synthetic data... Fitting the nullified model... Generating synthetic data... Fitting the full model on synthetic data... Estimating effects on real and synthetic data... Fitting the nullified model... Generating synthetic data... Fitting the full model on synthetic data... Estimating effects on real and synthetic data... Fitting the nullified model... Generating synthetic data... Fitting the full model on synthetic data... Estimating effects on real and synthetic data... Indirect effects for direct setting 1 Indirect effects for direct setting 2 Indirect effects for direct setting 1 Indirect effects for direct setting 2 Indirect effects for direct setting 1 Indirect effects for direct setting 2 Indirect effects for direct setting 1 Indirect effects for direct setting 2 Indirect effects for direct setting 1 Indirect effects for direct setting 2 Indirect effects for direct setting 1 Indirect effects for direct setting 2 Indirect effects for direct setting 1 Indirect effects for direct setting 2 Indirect effects for direct setting 1 Indirect effects for direct setting 2 Indirect effects for direct setting 1 Indirect effects for direct setting 2 [ FAIL 2 | WARN 11 | SKIP 0 | PASS 86 ] ══ Failed tests ════════════════════════════════════════════════════════════════ ── Error ('test-estimators.R:29:5'): Can compile and estimate a BRMS model. ──── Error in `compileCode(f, code, language = language, verbose = verbose)`: odel = model8324157d4bb0__namespace::model8324157d4bb0_; BaseRNG = boost::random::additive_combine_engine<boost::random::linear_congruential_engine<unsigned int, 40014, 0, 2147483563>, boost::random::linear_congruential_engine<unsigned int, 40692, 0, 2147483399> >]' 22 | return 0.5 * z.p.transpose() * z.inv_e_metric_ * z.p; D:/RCompile/CRANpkg/lib/4.7/StanHeaders/include/src/stan/mcmc/hmc/hamiltonians/dense_e_metric.hpp:21:0: required from here 21 | double T(dense_e_point& z) { D:/RCompile/CRANpkg/lib/4.7/RcppEigen/include/Eigen/src/Core/DenseCoeffsBase.h:654:74: warning: ignoring attributes on template argument 'Eigen::internal::packet_traits<double>::type' {aka '__m128d'} [-Wignored-attributes] 654 | return internal::first_aligned<int(unpacket_traits<DefaultPacketType>::alignment),Derived>(m); | ^~~~~~~~~ make[1]: *** [D:/RCompile/recent/R/etc/x64/Makeconf:304: file832458e4213a.o] Error 1 Backtrace: ▆ 1. └─multimedia::estimate(model, exper) at test-estimators.R:29:5 2. └─multimedia (local) outcome_est(f, data) 3. ├─rlang::inject(brm_cache(fmla, data, !!!params)) 4. └─multimedia:::brm_cache(fmla, data, chains = 1, refresh = 0, silent = 0) 5. └─brms::brm(sub_formula(formula, ys[1]), data, ...) 6. └─brms::do_call(compile_model, compile_args) 7. └─brms:::eval2(call, envir = args, enclos = envir) 8. └─base::eval(expr, envir, ...) 9. └─base::eval(expr, envir, ...) 10. └─brms (local) .fun(...) 11. └─brms (local) .compile_model(model, ...) 12. ├─brms:::eval_silent(...) 13. │ └─base::eval(expr, envir) 14. │ └─base::eval(expr, envir) 15. └─brms::do_call(rstan::stan_model, args) 16. └─brms:::eval2(call, envir = args, enclos = envir) 17. └─base::eval(expr, envir, ...) 18. └─base::eval(expr, envir, ...) 19. └─rstan (local) .fun(model_code = .x1) 20. └─rstan:::cxxfunctionplus(...) 21. ├─pkgbuild::with_build_tools(...) 22. │ └─pkgbuild:::withr_with_path(rtools_path(), code) 23. │ └─base::force(code) 24. └─inline::cxxfunction(...) 25. └─inline:::compileCode(f, code, language = language, verbose = verbose) ── Error ('test-estimators.R:29:5'): Can compile and estimate a BRMS model. ──── Error in `sink(type = "output")`: invalid connection Backtrace: ▆ 1. └─multimedia::estimate(model, exper) at test-estimators.R:29:5 2. └─multimedia (local) outcome_est(f, data) 3. ├─rlang::inject(brm_cache(fmla, data, !!!params)) 4. └─multimedia:::brm_cache(fmla, data, chains = 1, refresh = 0, silent = 0) 5. └─brms::brm(sub_formula(formula, ys[1]), data, ...) 6. └─brms::do_call(compile_model, compile_args) 7. └─brms:::eval2(call, envir = args, enclos = envir) 8. └─base::eval(expr, envir, ...) 9. └─base::eval(expr, envir, ...) 10. └─brms (local) .fun(...) 11. └─brms (local) .compile_model(model, ...) 12. ├─brms:::eval_silent(...) 13. │ └─base::eval(expr, envir) 14. │ └─base::eval(expr, envir) 15. └─brms::do_call(rstan::stan_model, args) 16. └─brms:::eval2(call, envir = args, enclos = envir) 17. └─base::eval(expr, envir, ...) 18. └─base::eval(expr, envir, ...) 19. └─rstan (local) .fun(model_code = .x1) 20. └─rstan:::cxxfunctionplus(...) 21. └─base::sink(type = "output") [ FAIL 2 | WARN 11 | SKIP 0 | PASS 86 ] Error: ! Test failures. Execution halted Flavor: r-devel-windows-x86_64

Version: 0.2.0
Check: tests
Result: ERROR Running 'testthat.R' [94s] Running the tests in 'tests/testthat.R' failed. Complete output: > # This file is part of the standard setup for testthat. > # It is recommended that you do not modify it. > # > # Where should you do additional test configuration? > # Learn more about the roles of various files in: > # * https://r-pkgs.org/testing-design.html#sec-tests-files-overview > # * https://testthat.r-lib.org/articles/special-files.html > > library(testthat) > library(multimedia) Loading required package: brms Loading required package: Rcpp Loading 'brms' package (version 2.23.0). Useful instructions can be found by typing help('brms'). A more detailed introduction to the package is available through vignette('brms_overview'). Attaching package: 'brms' The following object is masked from 'package:stats': ar Loading required package: glmnetUtils Loading required package: ranger Loading required package: tidyselect > > test_check("multimedia") Bootstrapping direct Bootstrapping direct Indirect effects for direct setting 1 Indirect effects for direct setting 2 Compiling Stan program... specified C++17 make cmd is make -f "D:/RCompile/recent/R-4.6.1/etc/x64/Makeconf" -f "D:/RCompile/recent/R-4.6.1/share/make/winshlib.mk" CXX='$(CXX17) $(CXX17STD)' CXXFLAGS='$(CXX17FLAGS)' CXXPICFLAGS='$(CXX17PICFLAGS)' SHLIB_LDFLAGS='$(SHLIB_CXX17LDFLAGS)' SHLIB_LD='$(SHLIB_CXX17LD)' SHLIB="file4b98c4cbc5ec9.dll" WIN=64 TCLBIN= OBJECTS="file4b98c4cbc5ec9.o" make would use make[1]: Entering directory '/d/temp/2026_10_18_01_50_00_12083/RtmpYfH4QY' g++ -std=gnu++17 -I"D:/RCompile/recent/R-4.6.1/include" -DNDEBUG -I"D:/RCompile/CRANpkg/lib/4.6/Rcpp/include/" -I"D:/temp/2026_10_18_01_50_00_12083/RtmpIJmNyg/RLIBS_30c5443461f6d/RcppEigen/include/" -I"D:/temp/2026_10_18_01_50_00_12083/RtmpIJmNyg/RLIBS_30c5443461f6d/RcppEigen/include/unsupported" -I"D:/temp/2026_10_18_01_50_00_12083/RtmpIJmNyg/RLIBS_30c5443461f6d/BH/include" -I"D:/RCompile/CRANpkg/lib/4.6/StanHeaders/include/src/" -I"D:/RCompile/CRANpkg/lib/4.6/StanHeaders/include/" -I"D:/RCompile/CRANpkg/lib/4.6/RcppParallel/include/" -DRCPP_PARALLEL_USE_TBB=1 -DTBB_INTERFACE_NEW -ID:/RCompile/CRANpkg/lib/4.6/RcppParallel/include -I"D:/RCompile/CRANpkg/lib/4.6/rstan/include" -DEIGEN_NO_DEBUG -DBOOST_DISABLE_ASSERTS -DBOOST_PENDING_INTEGER_LOG2_HPP -DSTAN_THREADS -DUSE_STANC3 -DSTRICT_R_HEADERS -DBOOST_PHOENIX_NO_VARIADIC_EXPRESSION -D_HAS_AUTO_PTR_ETC=0 -include "D:/RCompile/CRANpkg/lib/4.6/StanHeaders/include/stan/math/prim/fun/Eigen.hpp" -std=c++1y -I"d:/rtools45/x86_64-w64-mingw32.static.posix/include" -O2 -Wall -mfpmath=sse -msse2 -mstackrealign -c file4b98c4cbc5ec9.cpp -o file4b98c4cbc5ec9.o if test "zfile4b98c4cbc5ec9.o" != "z"; then \ if test -e "file4b98c4cbc5ec9-win.def"; then \ echo g++ -shared -s -static-libgcc -o file4b98c4cbc5ec9.dll file4b98c4cbc5ec9-win.def file4b98c4cbc5ec9.o "D:/RCompile/CRANpkg/lib/4.6/rstan/lib/x64/libStanServices.a" -L"D:/RCompile/CRANpkg/lib/4.6/StanHeaders/libs/x64" -lStanHeaders -L"D:/RCompile/CRANpkg/lib/4.6/RcppParallel/lib/x64" -ltbb -LD:/RCompile/CRANpkg/lib/4.6/RcppParallel/libs/x64 -lRcppParallel -LD:/RCompile/CRANpkg/lib/4.6/RcppParallel/lib/x64 -ltbb -ltbbmalloc -L"d:/rtools45/x86_64-w64-mingw32.static.posix/lib/x64" -L"d:/rtools45/x86_64-w64-mingw32.static.posix/lib" -L"D:/RCompile/recent/R-4.6.1/bin/x64" -lR ; \ g++ -shared -s -static-libgcc -o file4b98c4cbc5ec9.dll file4b98c4cbc5ec9-win.def file4b98c4cbc5ec9.o "D:/RCompile/CRANpkg/lib/4.6/rstan/lib/x64/libStanServices.a" -L"D:/RCompile/CRANpkg/lib/4.6/StanHeaders/libs/x64" -lStanHeaders -L"D:/RCompile/CRANpkg/lib/4.6/RcppParallel/lib/x64" -ltbb -LD:/RCompile/CRANpkg/lib/4.6/RcppParallel/libs/x64 -lRcppParallel -LD:/RCompile/CRANpkg/lib/4.6/RcppParallel/lib/x64 -ltbb -ltbbmalloc -L"d:/rtools45/x86_64-w64-mingw32.static.posix/lib/x64" -L"d:/rtools45/x86_64-w64-mingw32.static.posix/lib" -L"D:/RCompile/recent/R-4.6.1/bin/x64" -lR ; \ else \ echo EXPORTS > tmp.def; \ nm file4b98c4cbc5ec9.o | sed -n 's/^.* [BCDRT] / /p' | sed -e '/[.]refptr[.]/d' -e '/[.]weak[.]/d' | sed 's/[^ ][^ ]*/"&"/g' >> tmp.def; \ echo g++ -shared -s -static-libgcc -o file4b98c4cbc5ec9.dll tmp.def file4b98c4cbc5ec9.o "D:/RCompile/CRANpkg/lib/4.6/rstan/lib/x64/libStanServices.a" -L"D:/RCompile/CRANpkg/lib/4.6/StanHeaders/libs/x64" -lStanHeaders -L"D:/RCompile/CRANpkg/lib/4.6/RcppParallel/lib/x64" -ltbb -LD:/RCompile/CRANpkg/lib/4.6/RcppParallel/libs/x64 -lRcppParallel -LD:/RCompile/CRANpkg/lib/4.6/RcppParallel/lib/x64 -ltbb -ltbbmalloc -L"d:/rtools45/x86_64-w64-mingw32.static.posix/lib/x64" -L"d:/rtools45/x86_64-w64-mingw32.static.posix/lib" -L"D:/RCompile/recent/R-4.6.1/bin/x64" -lR ; \ g++ -shared -s -static-libgcc -o file4b98c4cbc5ec9.dll tmp.def file4b98c4cbc5ec9.o "D:/RCompile/CRANpkg/lib/4.6/rstan/lib/x64/libStanServices.a" -L"D:/RCompile/CRANpkg/lib/4.6/StanHeaders/libs/x64" -lStanHeaders -L"D:/RCompile/CRANpkg/lib/4.6/RcppParallel/lib/x64" -ltbb -LD:/RCompile/CRANpkg/lib/4.6/RcppParallel/libs/x64 -lRcppParallel -LD:/RCompile/CRANpkg/lib/4.6/RcppParallel/lib/x64 -ltbb -ltbbmalloc -L"d:/rtools45/x86_64-w64-mingw32.static.posix/lib/x64" -L"d:/rtools45/x86_64-w64-mingw32.static.posix/lib" -L"D:/RCompile/recent/R-4.6.1/bin/x64" -lR ; \ rm -f tmp.def; \ fi \ fi make[1]: Leaving directory '/d/temp/2026_10_18_01_50_00_12083/RtmpYfH4QY' Saving _problems/test-estimators-29.R Fitting the nullified model... Generating synthetic data... Fitting the full model on synthetic data... Estimating effects on real and synthetic data... Fitting the nullified model... Generating synthetic data... Fitting the full model on synthetic data... Estimating effects on real and synthetic data... Fitting the nullified model... Generating synthetic data... Fitting the full model on synthetic data... Estimating effects on real and synthetic data... Fitting the nullified model... Generating synthetic data... Fitting the full model on synthetic data... Estimating effects on real and synthetic data... Indirect effects for direct setting 1 Indirect effects for direct setting 2 Indirect effects for direct setting 1 Indirect effects for direct setting 2 Indirect effects for direct setting 1 Indirect effects for direct setting 2 Indirect effects for direct setting 1 Indirect effects for direct setting 2 Indirect effects for direct setting 1 Indirect effects for direct setting 2 Indirect effects for direct setting 1 Indirect effects for direct setting 2 Indirect effects for direct setting 1 Indirect effects for direct setting 2 Indirect effects for direct setting 1 Indirect effects for direct setting 2 Indirect effects for direct setting 1 Indirect effects for direct setting 2 [ FAIL 2 | WARN 1 | SKIP 0 | PASS 86 ] ══ Failed tests ════════════════════════════════════════════════════════════════ ── Error ('test-estimators.R:29:5'): Can compile and estimate a BRMS model. ──── Error in `compileCode(f, code, language = language, verbose = verbose)`: del4b98c7d863ff1__namespace::model4b98c7d863ff1_; BaseRNG = boost::random::additive_combine_engine<boost::random::linear_congruential_engine<unsigned int, 40014, 0, 2147483563>, boost::random::linear_congruential_engine<unsigned int, 40692, 0, 2147483399> >]' 22 | return 0.5 * z.p.transpose() * z.inv_e_metric_ * z.p; D:/RCompile/CRANpkg/lib/4.6/StanHeaders/include/src/stan/mcmc/hmc/hamiltonians/dense_e_metric.hpp:21:0: required from here 21 | double T(dense_e_point& z) { D:/RCompile/CRANpkg/lib/4.6/RcppEigen/include/Eigen/src/Core/DenseCoeffsBase.h:654:74: warning: ignoring attributes on template argument 'Eigen::internal::packet_traits<double>::type' {aka '__m128d'} [-Wignored-attributes] 654 | return internal::first_aligned<int(unpacket_traits<DefaultPacketType>::alignment),Derived>(m); | ^~~~~~~~~ make[1]: *** [D:/RCompile/recent/R-4.6.1/etc/x64/Makeconf:304: file4b98c4cbc5ec9.o] Error 1 Backtrace: ▆ 1. └─multimedia::estimate(model, exper) at test-estimators.R:29:5 2. └─multimedia (local) outcome_est(f, data) 3. ├─rlang::inject(brm_cache(fmla, data, !!!params)) 4. └─multimedia:::brm_cache(fmla, data, chains = 1, refresh = 0, silent = 0) 5. └─brms::brm(sub_formula(formula, ys[1]), data, ...) 6. └─brms::do_call(compile_model, compile_args) 7. └─brms:::eval2(call, envir = args, enclos = envir) 8. └─base::eval(expr, envir, ...) 9. └─base::eval(expr, envir, ...) 10. └─brms (local) .fun(...) 11. └─brms (local) .compile_model(model, ...) 12. ├─brms:::eval_silent(...) 13. │ └─base::eval(expr, envir) 14. │ └─base::eval(expr, envir) 15. └─brms::do_call(rstan::stan_model, args) 16. └─brms:::eval2(call, envir = args, enclos = envir) 17. └─base::eval(expr, envir, ...) 18. └─base::eval(expr, envir, ...) 19. └─rstan (local) .fun(model_code = .x1) 20. └─rstan:::cxxfunctionplus(...) 21. ├─pkgbuild::with_build_tools(...) 22. │ └─pkgbuild:::withr_with_path(rtools_path(), code) 23. │ └─base::force(code) 24. └─inline::cxxfunction(...) 25. └─inline:::compileCode(f, code, language = language, verbose = verbose) ── Error ('test-estimators.R:29:5'): Can compile and estimate a BRMS model. ──── Error in `sink(type = "output")`: invalid connection Backtrace: ▆ 1. └─multimedia::estimate(model, exper) at test-estimators.R:29:5 2. └─multimedia (local) outcome_est(f, data) 3. ├─rlang::inject(brm_cache(fmla, data, !!!params)) 4. └─multimedia:::brm_cache(fmla, data, chains = 1, refresh = 0, silent = 0) 5. └─brms::brm(sub_formula(formula, ys[1]), data, ...) 6. └─brms::do_call(compile_model, compile_args) 7. └─brms:::eval2(call, envir = args, enclos = envir) 8. └─base::eval(expr, envir, ...) 9. └─base::eval(expr, envir, ...) 10. └─brms (local) .fun(...) 11. └─brms (local) .compile_model(model, ...) 12. ├─brms:::eval_silent(...) 13. │ └─base::eval(expr, envir) 14. │ └─base::eval(expr, envir) 15. └─brms::do_call(rstan::stan_model, args) 16. └─brms:::eval2(call, envir = args, enclos = envir) 17. └─base::eval(expr, envir, ...) 18. └─base::eval(expr, envir, ...) 19. └─rstan (local) .fun(model_code = .x1) 20. └─rstan:::cxxfunctionplus(...) 21. └─base::sink(type = "output") [ FAIL 2 | WARN 1 | SKIP 0 | PASS 86 ] Error: ! Test failures. Execution halted Flavor: r-release-windows-x86_64

Version: 0.2.0
Check: tests
Result: ERROR Running 'testthat.R' [130s] Running the tests in 'tests/testthat.R' failed. Complete output: > # This file is part of the standard setup for testthat. > # It is recommended that you do not modify it. > # > # Where should you do additional test configuration? > # Learn more about the roles of various files in: > # * https://r-pkgs.org/testing-design.html#sec-tests-files-overview > # * https://testthat.r-lib.org/articles/special-files.html > > library(testthat) > library(multimedia) Loading required package: brms Loading required package: Rcpp Loading 'brms' package (version 2.23.0). Useful instructions can be found by typing help('brms'). A more detailed introduction to the package is available through vignette('brms_overview'). Attaching package: 'brms' The following object is masked from 'package:stats': ar Loading required package: glmnetUtils Loading required package: ranger Loading required package: tidyselect > > test_check("multimedia") Bootstrapping direct Bootstrapping direct Indirect effects for direct setting 1 Indirect effects for direct setting 2 Compiling Stan program... make cmd is make -f "D:/RCompile/recent/R-4.5.3/etc/x64/Makeconf" -f "D:/RCompile/recent/R-4.5.3/share/make/winshlib.mk" CXX='$(CXX17) $(CXX17STD)' CXXFLAGS='$(CXX17FLAGS)' CXXPICFLAGS='$(CXX17PICFLAGS)' SHLIB_LDFLAGS='$(SHLIB_CXX17LDFLAGS)' SHLIB_LD='$(SHLIB_CXX17LD)' SHLIB="file1b07c4c1171ca.dll" WIN=64 TCLBIN= OBJECTS="file1b07c4c1171ca.o" make would use make[1]: Entering directory '/d/temp/2026_10_16_17_16_37_22563/RtmpQNcpx5' g++ -std=gnu++17 -I"D:/RCompile/recent/R-4.5.3/include" -DNDEBUG -I"D:/RCompile/CRANpkg/lib/4.5/Rcpp/include/" -I"D:/temp/2026_10_16_17_16_37_22563/RtmpSqCsY4/RLIBS_18d0c676f41fc/RcppEigen/include/" -I"D:/temp/2026_10_16_17_16_37_22563/RtmpSqCsY4/RLIBS_18d0c676f41fc/RcppEigen/include/unsupported" -I"D:/temp/2026_10_16_17_16_37_22563/RtmpSqCsY4/RLIBS_18d0c676f41fc/BH/include" -I"D:/RCompile/CRANpkg/lib/4.5/StanHeaders/include/src/" -I"D:/RCompile/CRANpkg/lib/4.5/StanHeaders/include/" -I"D:/RCompile/CRANpkg/lib/4.5/RcppParallel/include/" -DRCPP_PARALLEL_USE_TBB=1 -DTBB_INTERFACE_NEW -ID:/RCompile/CRANpkg/lib/4.5/RcppParallel/include -I"D:/RCompile/CRANpkg/lib/4.5/rstan/include" -DEIGEN_NO_DEBUG -DBOOST_DISABLE_ASSERTS -DBOOST_PENDING_INTEGER_LOG2_HPP -DSTAN_THREADS -DUSE_STANC3 -DSTRICT_R_HEADERS -DBOOST_PHOENIX_NO_VARIADIC_EXPRESSION -D_HAS_AUTO_PTR_ETC=0 -include "D:/RCompile/CRANpkg/lib/4.5/StanHeaders/include/stan/math/prim/fun/Eigen.hpp" -std=c++1y -I"d:/rtools45/x86_64-w64-mingw32.static.posix/include" -O2 -Wall -mfpmath=sse -msse2 -mstackrealign -c file1b07c4c1171ca.cpp -o file1b07c4c1171ca.o if test "zfile1b07c4c1171ca.o" != "z"; then \ if test -e "file1b07c4c1171ca-win.def"; then \ echo g++ -shared -s -static-libgcc -o file1b07c4c1171ca.dll file1b07c4c1171ca-win.def file1b07c4c1171ca.o "D:/RCompile/CRANpkg/lib/4.5/rstan/lib/x64/libStanServices.a" -L"D:/RCompile/CRANpkg/lib/4.5/StanHeaders/libs/x64" -lStanHeaders -L"D:/RCompile/CRANpkg/lib/4.5/RcppParallel/lib/x64" -ltbb -LD:/RCompile/CRANpkg/lib/4.5/RcppParallel/libs/x64 -lRcppParallel -LD:/RCompile/CRANpkg/lib/4.5/RcppParallel/lib/x64 -ltbb -ltbbmalloc -L"d:/rtools45/x86_64-w64-mingw32.static.posix/lib/x64" -L"d:/rtools45/x86_64-w64-mingw32.static.posix/lib" -L"D:/RCompile/recent/R-4.5.3/bin/x64" -lR ; \ g++ -shared -s -static-libgcc -o file1b07c4c1171ca.dll file1b07c4c1171ca-win.def file1b07c4c1171ca.o "D:/RCompile/CRANpkg/lib/4.5/rstan/lib/x64/libStanServices.a" -L"D:/RCompile/CRANpkg/lib/4.5/StanHeaders/libs/x64" -lStanHeaders -L"D:/RCompile/CRANpkg/lib/4.5/RcppParallel/lib/x64" -ltbb -LD:/RCompile/CRANpkg/lib/4.5/RcppParallel/libs/x64 -lRcppParallel -LD:/RCompile/CRANpkg/lib/4.5/RcppParallel/lib/x64 -ltbb -ltbbmalloc -L"d:/rtools45/x86_64-w64-mingw32.static.posix/lib/x64" -L"d:/rtools45/x86_64-w64-mingw32.static.posix/lib" -L"D:/RCompile/recent/R-4.5.3/bin/x64" -lR ; \ else \ echo EXPORTS > tmp.def; \ nm file1b07c4c1171ca.o | sed -n 's/^.* [BCDRT] / /p' | sed -e '/[.]refptr[.]/d' -e '/[.]weak[.]/d' | sed 's/[^ ][^ ]*/"&"/g' >> tmp.def; \ echo g++ -shared -s -static-libgcc -o file1b07c4c1171ca.dll tmp.def file1b07c4c1171ca.o "D:/RCompile/CRANpkg/lib/4.5/rstan/lib/x64/libStanServices.a" -L"D:/RCompile/CRANpkg/lib/4.5/StanHeaders/libs/x64" -lStanHeaders -L"D:/RCompile/CRANpkg/lib/4.5/RcppParallel/lib/x64" -ltbb -LD:/RCompile/CRANpkg/lib/4.5/RcppParallel/libs/x64 -lRcppParallel -LD:/RCompile/CRANpkg/lib/4.5/RcppParallel/lib/x64 -ltbb -ltbbmalloc -L"d:/rtools45/x86_64-w64-mingw32.static.posix/lib/x64" -L"d:/rtools45/x86_64-w64-mingw32.static.posix/lib" -L"D:/RCompile/recent/R-4.5.3/bin/x64" -lR ; \ g++ -shared -s -static-libgcc -o file1b07c4c1171ca.dll tmp.def file1b07c4c1171ca.o "D:/RCompile/CRANpkg/lib/4.5/rstan/lib/x64/libStanServices.a" -L"D:/RCompile/CRANpkg/lib/4.5/StanHeaders/libs/x64" -lStanHeaders -L"D:/RCompile/CRANpkg/lib/4.5/RcppParallel/lib/x64" -ltbb -LD:/RCompile/CRANpkg/lib/4.5/RcppParallel/libs/x64 -lRcppParallel -LD:/RCompile/CRANpkg/lib/4.5/RcppParallel/lib/x64 -ltbb -ltbbmalloc -L"d:/rtools45/x86_64-w64-mingw32.static.posix/lib/x64" -L"d:/rtools45/x86_64-w64-mingw32.static.posix/lib" -L"D:/RCompile/recent/R-4.5.3/bin/x64" -lR ; \ rm -f tmp.def; \ fi \ fi make[1]: Leaving directory '/d/temp/2026_10_16_17_16_37_22563/RtmpQNcpx5' Saving _problems/test-estimators-29.R Fitting the nullified model... Generating synthetic data... Fitting the full model on synthetic data... Estimating effects on real and synthetic data... Fitting the nullified model... Generating synthetic data... Fitting the full model on synthetic data... Estimating effects on real and synthetic data... Fitting the nullified model... Generating synthetic data... Fitting the full model on synthetic data... Estimating effects on real and synthetic data... Fitting the nullified model... Generating synthetic data... Fitting the full model on synthetic data... Estimating effects on real and synthetic data... Indirect effects for direct setting 1 Indirect effects for direct setting 2 Indirect effects for direct setting 1 Indirect effects for direct setting 2 Indirect effects for direct setting 1 Indirect effects for direct setting 2 Indirect effects for direct setting 1 Indirect effects for direct setting 2 Indirect effects for direct setting 1 Indirect effects for direct setting 2 Indirect effects for direct setting 1 Indirect effects for direct setting 2 Indirect effects for direct setting 1 Indirect effects for direct setting 2 Indirect effects for direct setting 1 Indirect effects for direct setting 2 Indirect effects for direct setting 1 Indirect effects for direct setting 2 [ FAIL 2 | WARN 1 | SKIP 0 | PASS 86 ] ══ Failed tests ════════════════════════════════════════════════════════════════ ── Error ('test-estimators.R:29:5'): Can compile and estimate a BRMS model. ──── Error in `compileCode(f, code, language = language, verbose = verbose)`: del1b07c1d3f4a75__namespace::model1b07c1d3f4a75_; BaseRNG = boost::random::additive_combine_engine<boost::random::linear_congruential_engine<unsigned int, 40014, 0, 2147483563>, boost::random::linear_congruential_engine<unsigned int, 40692, 0, 2147483399> >]' 22 | return 0.5 * z.p.transpose() * z.inv_e_metric_ * z.p; D:/RCompile/CRANpkg/lib/4.5/StanHeaders/include/src/stan/mcmc/hmc/hamiltonians/dense_e_metric.hpp:21:0: required from here 21 | double T(dense_e_point& z) { D:/RCompile/CRANpkg/lib/4.5/RcppEigen/include/Eigen/src/Core/DenseCoeffsBase.h:654:74: warning: ignoring attributes on template argument 'Eigen::internal::packet_traits<double>::type' {aka '__m128d'} [-Wignored-attributes] 654 | return internal::first_aligned<int(unpacket_traits<DefaultPacketType>::alignment),Derived>(m); | ^~~~~~~~~ make[1]: *** [D:/RCompile/recent/R-4.5.3/etc/x64/Makeconf:302: file1b07c4c1171ca.o] Error 1 Backtrace: ▆ 1. └─multimedia::estimate(model, exper) at test-estimators.R:29:5 2. └─multimedia (local) outcome_est(f, data) 3. ├─rlang::inject(brm_cache(fmla, data, !!!params)) 4. └─multimedia:::brm_cache(fmla, data, chains = 1, refresh = 0, silent = 0) 5. └─brms::brm(sub_formula(formula, ys[1]), data, ...) 6. └─brms::do_call(compile_model, compile_args) 7. └─brms:::eval2(call, envir = args, enclos = envir) 8. └─base::eval(expr, envir, ...) 9. └─base::eval(expr, envir, ...) 10. └─brms (local) .fun(...) 11. └─brms (local) .compile_model(model, ...) 12. ├─brms:::eval_silent(...) 13. │ └─base::eval(expr, envir) 14. │ └─base::eval(expr, envir) 15. └─brms::do_call(rstan::stan_model, args) 16. └─brms:::eval2(call, envir = args, enclos = envir) 17. └─base::eval(expr, envir, ...) 18. └─base::eval(expr, envir, ...) 19. └─rstan (local) .fun(model_code = .x1) 20. └─rstan:::cxxfunctionplus(...) 21. ├─pkgbuild::with_build_tools(...) 22. │ └─pkgbuild:::withr_with_path(rtools_path(), code) 23. │ └─base::force(code) 24. └─inline::cxxfunction(...) 25. └─inline:::compileCode(f, code, language = language, verbose = verbose) ── Error ('test-estimators.R:29:5'): Can compile and estimate a BRMS model. ──── Error in `sink(type = "output")`: invalid connection Backtrace: ▆ 1. └─multimedia::estimate(model, exper) at test-estimators.R:29:5 2. └─multimedia (local) outcome_est(f, data) 3. ├─rlang::inject(brm_cache(fmla, data, !!!params)) 4. └─multimedia:::brm_cache(fmla, data, chains = 1, refresh = 0, silent = 0) 5. └─brms::brm(sub_formula(formula, ys[1]), data, ...) 6. └─brms::do_call(compile_model, compile_args) 7. └─brms:::eval2(call, envir = args, enclos = envir) 8. └─base::eval(expr, envir, ...) 9. └─base::eval(expr, envir, ...) 10. └─brms (local) .fun(...) 11. └─brms (local) .compile_model(model, ...) 12. ├─brms:::eval_silent(...) 13. │ └─base::eval(expr, envir) 14. │ └─base::eval(expr, envir) 15. └─brms::do_call(rstan::stan_model, args) 16. └─brms:::eval2(call, envir = args, enclos = envir) 17. └─base::eval(expr, envir, ...) 18. └─base::eval(expr, envir, ...) 19. └─rstan (local) .fun(model_code = .x1) 20. └─rstan:::cxxfunctionplus(...) 21. └─base::sink(type = "output") [ FAIL 2 | WARN 1 | SKIP 0 | PASS 86 ] Error: ! Test failures. Execution halted Flavor: r-oldrel-windows-x86_64